{"text_format":"1","workbook":"xlsx","n_sheets":3,"sheets":["Sheet1","Sheet2","Sheet3"],"not_rendered":{"charts":0,"images":0,"macros":1,"external_links":0,"defined_names":0,"comments":0,"pivot_tables":0},"unopened":[],"bounds":{"document_bytes":16777216,"sheet_cells":100000,"rows_first":2000,"rows_last":500,"rows_between":2000,"halvings":0,"cell_chars":16384,"cell_head_chars":4096},"cells_cut":0,"cells_raw":0,"read":"whole","date_system":"1900"}

{"sheet":"Sheet1","index":0,"n_rows":93,"n_cols":31,"rows_kept":93,"cut":false,"hidden":false,"merged":[[1,29,2,29],[1,30,2,30]]}
[null,"Kinross Road Runners 2015 Club Championship"]
[null,null,null,null,"Cupar 5","Cupar 5","Smokies 10","Smokies 10","Alloa Half","Alloa Half","Tay Ten","Tay Ten","Kinross PTA 10k","Glenrothes 10k","BrigBash 5m","BrigBash 5m","Perth Parkrun","Perth Parkrun","Kn'khill 3.9M","Kn'hill 3.9M","Forfar 10k","Stirling 10k","East Neuk 10k","Kirkcaldy Parkrun","Kirkcaldy Parkrun","Neil McCover Half Marathon","Neil McCover Half","Number of Races","Average Time","No. Races  for ranking","Best 6 Average Time"]
[null,null,null,null,"Actual","10k Equiv","Actual","10k Equiv","Actual","10k Equiv","Actual","10k Equiv","10k Equiv","10k Equiv","Actual","10k Equiv","Actual","10k Equiv","Actual","10k Equiv","10k Equiv","10k Equiv","10k Equiv","Actual","10k Equiv","Actual","10k Equiv"]
[null,"Surname","First",null,"hh:mm:ss","hh:mm:ss","hh:mm:ss","hh:mm:ss","hh:mm:ss","hh:mm:ss","hh:mm:ss","hh:mm:ss","hh:mm:ss","hh:mm:ss","hh:mm:ss","hh:mm:ss","hh:mm:ss","hh:mm:ss","hh:mm:ss","hh:mm:ss","hh:mm:ss","hh:mm:ss","hh:mm:ss","hh:mm:ss","hh:mm:ss","hh:mm:ss","hh:mm:ss",null,"hh:mm:ss",null,"hh:mm:ss"]
[null,"Test","Test",null,1.1574074074074073E-5,{"$f":"(E5*86400)*POWER((6.2138818/5),1.07)/86400","v":1.4604501912263331E-5},1.1574074074074073E-5,{"$f":"(G5*86400)*POWER((6.2138818/10),1.07)/86400","v":6.9564017320636968E-6},1.1574074074074073E-5,{"$f":"(I5*86400)*POWER((6.2138818/13.1094),1.07)/86400","v":5.2068017535773476E-6},1.1574074074074073E-5,{"$f":"(K5*86400)*POWER((6.2138818/10),1.07)/86400","v":6.9564017320636968E-6},1.1574074074074073E-5,1.1574074074074073E-5,1.1574074074074073E-5,{"$f":"(O5*86400)*POWER((6.2138818/5),1.07)/86400","v":1.4604501912263331E-5},1.1574074074074073E-5,{"$f":"(Q5*86400)*POWER((10/5),1.07)/86400","v":2.4298997306089522E-5},1.1574074074074073E-5,{"$f":"(S5*86400)*POWER((6.2138818/3.9),1.07)/86400","v":1.9052217248335972E-5},1.1574074074074073E-5,1.1574074074074073E-5,1.1574074074074073E-5,1.1574074074074073E-5,{"$f":"(X5*86400)*POWER((10/5),1.07)/86400","v":2.4298997306089522E-5},1.1574074074074073E-5,{"$f":"(Z5*86400)*POWER((6.2138818/13.1094),1.07)/86400","v":5.2068017535773476E-6},{"$f":"COUNT(F5,H5,J5,L5:N5,R5:R5,P5,T5:V5,W5,Y5,AA5)","v":14},{"$f":"IFERROR(AVERAGE(F5,H5,J5,L5:N5,R5:R5,P5,T5:W5,Y5,AA5),\"No race run\")","v":1.2789713787621012E-5},{"$f":"IF(COUNT(F5,H5,J5,L5,M5,N5,P5,R5,T5,U5,V5,W5,Y5)>6,6,COUNT(F5,H5,J5,L5,M5,N5,P5,R5,T5,U5,V5,W5,Y5))","v":6},{"$f":"IFERROR(IF(AB5>6,AVERAGE(SMALL((F5,H5,J5,L5:N5,R5:R5,P5,T5:W5,Y5,AA5),{1,2,3,4,5,6})),AC5),\"No race run\")","v":7.9124258532383723E-6}]
[null,"Kemp","Allan","M",2.0023148148148148E-2,{"$f":"(E6*86400)*POWER((6.2138818/5),1.07)/86400","v":2.5265788308215565E-2},null,null,5.7175925925925929E-2,{"$f":"(I6*86400)*POWER((6.2138818/13.1094),1.07)/86400","v":2.5721600662672095E-2},4.3298611111111107E-2,{"$f":"(K6*86400)*POWER((6.2138818/10),1.07)/86400","v":2.6023898879650287E-2},null,null,"00:28:54",2.5324206315864614E-2,null,null,"00:22:18",{"$f":"(S6*86400)*POWER((6.2138818/3.9),1.07)/86400","v":2.549186667827353E-2},null,"00:37:13",null,1.2604166666666666E-2,2.646160806633149E-2,"01:23:52",{"$f":"(Z6*86400)*POWER((6.2138818/13.1094),1.07)/86400","v":2.620062642400121E-2},{"$f":"COUNT(F6,H6,J6,L6:N6,R6:R6,P6,T6:V6,W6,Y6,AA6)","v":8},{"$f":"IFERROR(AVERAGE(F6,H6,J6,L6:N6,R6:R6,P6,T6:W6,Y6,AA6),\"No race run\")","v":2.5791812842802023E-2},{"$f":"IF(COUNT(F6,H6,J6,L6,M6,N6,P6,R6,T6,U6,V6,W6,Y6)>6,6,COUNT(F6,H6,J6,L6,M6,N6,P6,R6,T6,U6,V6,W6,Y6))","v":6},{"$f":"IFERROR(IF(AB6>6,AVERAGE(SMALL((F6,H6,J6,L6:N6,R6:R6,P6,T6:W6,Y6,AA6),{1,2,3,4,5,6})),AC6),\"No race run\")","v":2.5612044708680583E-2}]
[null,"Strachan","Scott","M",2.1851851851851848E-2,{"$f":"(E7*86400)*POWER((6.2138818/5),1.07)/86400","v":2.7573299610353166E-2},null,null,6.0682870370370373E-2,{"$f":"(I7*86400)*POWER((6.2138818/13.1094),1.07)/86400","v":2.7299261594006034E-2},4.5925925925925926E-2,{"$f":"(K7*86400)*POWER((6.2138818/10),1.07)/86400","v":2.7603002072828751E-2},"00:39:22",null,"00:31:02",2.7193582560634325E-2,"00:18:56",{"$f":"(Q7*86400)*POWER((10/5),1.07)/86400","v":2.7603660939717691E-2},"00:23:56",{"$f":"(S7*86400)*POWER((6.2138818/3.9),1.07)/86400","v":2.7358983968610466E-2},"00:40:00","00:39:05","00:38:55",1.292824074074074E-2,2.7141979990901999E-2,null,null,11,2.7368743467678171E-2,6,{"$f":"IFERROR(IF(AB7>6,AVERAGE(SMALL((F7,H7,J7,L7:N7,R7:R7,P7,T7:W7,Y7,AA7),{1,2,3,4,5,6})),AC7),\"No race run\")","v":2.7189908962528663E-2}]
[null,"Gordon","Jillian","F",null,null,"01:06:25",{"$f":"(G8*86400)*POWER((6.2138818/10),1.07)/86400","v":2.7721260902273837E-2},5.935185185185185E-2,{"$f":"(I8*86400)*POWER((6.2138818/13.1094),1.07)/86400","v":2.6700479392344635E-2},"01:04:35",{"$f":"(K8*86400)*POWER((6.2138818/10),1.07)/86400","v":2.6956056711746827E-2},null,null,"00:32:41",2.8639428249948393E-2,null,null,"00:26:31",{"$f":"(S8*86400)*POWER((6.2138818/3.9),1.07)/86400","v":3.0312077642102534E-2},"00:42:55","00:41:22",null,"00:20:02",2.9207394761919608E-2,"01:29:14",{"$f":"(Z8*86400)*POWER((6.2138818/13.1094),1.07)/86400","v":2.7877216588653116E-2},9,2.8438222982397954E-2,6,{"$f":"IFERROR(IF(AB8>6,AVERAGE(SMALL((F8,H8,J8,L8:N8,R8:R8,P8,T8:W8,Y8,AA8),{1,2,3,4,5,6})),AC8),\"No race run\")","v":2.7770215616136445E-2}]
[null,"Newton","Matt","M",null,null,null,null,null,null,null,null,2.7615740740740743E-2,null,"00:31:32",2.7631717618002222E-2,1.3101851851851852E-2,{"$f":"(Q9*86400)*POWER((10/5),1.07)/86400","v":2.7506464950493338E-2},null,null,"00:42:24","00:40:25",null,1.3321759259259261E-2,2.7968145899309047E-2,null,null,6,2.8038940547103236E-2,6,{"$f":"IFERROR(IF(AB9>6,AVERAGE(SMALL((F9,H9,J9,L9:N9,R9:R9,P9,T9:W9,Y9,AA9),{1,2,3,4,5,6})),AC9),\"No race run\")","v":2.8038940547103236E-2}]
[null,"Kemp","Graham","M",2.2523148148148143E-2,{"$f":"(E10*86400)*POWER((6.2138818/5),1.07)/86400","v":2.8420360721264436E-2},null,null,6.3194444444444442E-2,{"$f":"(I10*86400)*POWER((6.2138818/13.1094),1.07)/86400","v":2.8429137574532314E-2},null,null,"00:40:40",null,"00:31:34",2.7660926621826749E-2,"00:19:10",{"$f":"(Q10*86400)*POWER((10/5),1.07)/86400","v":2.7943846902002956E-2},null,null,"00:43:02",null,"00:41:00",1.3414351851851851E-2,2.816253787775776E-2,null,null,8,2.8401753989950804E-2,6,{"$f":"IFERROR(IF(AB10>6,AVERAGE(SMALL((F10,H10,J10,L10:N10,R10:R10,P10,T10:W10,Y10,AA10),{1,2,3,4,5,6})),AC10),\"No race run\")","v":2.8142925073020825E-2}]
[null,"Edgerton","Peter","M",2.4641203703703703E-2,{"$f":"(E11*86400)*POWER((6.2138818/5),1.07)/86400","v":3.1092984571208633E-2},null,null,null,null,null,null,3.2152777777777773E-2,"00:41:49","00:35:05",3.0742476525314311E-2,1.4641203703703703E-2,{"$f":"(Q11*86400)*POWER((10/5),1.07)/86400","v":3.0738231592203243E-2},"00:25:56",{"$f":"(S11*86400)*POWER((6.2138818/3.9),1.07)/86400","v":2.9645250038410776E-2},null,"00:41:22","00:42:22",1.4016203703703704E-2,"00:42:22.414","01:29:50",{"$f":"(Z11*86400)*POWER((6.2138818/13.1094),1.07)/86400","v":2.8064661451781901E-2},10,2.9904996769437104E-2,6,{"$f":"IFERROR(IF(AB11>6,AVERAGE(SMALL((F11,H11,J11,L11:N11,R11:R11,P11,T11:W11,Y11,AA11),{1,2,3,4,5,6})),AC11),\"No race run\")","v":2.9053916204644512E-2}]
[null,"Hill","Martin","M",null,null,null,null,null,null,null,null,"00:42:54",null,"00:33:07",2.9019145299667242E-2,"00:19:54",{"$f":"(Q12*86400)*POWER((10/5),1.07)/86400","v":2.9013002783470892E-2},1.7743055555555557E-2,{"$f":"(S12*86400)*POWER((6.2138818/3.9),1.07)/86400","v":2.9207049041699053E-2},null,2.8819444444444443E-2,null,1.3680555555555555E-2,2.8721414815797815E-2,null,null,6,2.9095287175291019E-2,6,{"$f":"IFERROR(IF(AB12>6,AVERAGE(SMALL((F12,H12,J12,L12:N12,R12:R12,P12,T12:W12,Y12,AA12),{1,2,3,4,5,6})),AC12),\"No race run\")","v":2.9095287175291019E-2}]
[null,"Allcoat","Paul","M",null,null,null,null,null,null,null,null,3.1539351851851853E-2,"00:43:52","00:33:55",2.9720161391455877E-2,"00:20:49",{"$f":"(Q13*86400)*POWER((10/5),1.07)/86400","v":3.0349447635305813E-2},"00:25:51",{"$f":"(S13*86400)*POWER((6.2138818/3.9),1.07)/86400","v":2.9549988952169093E-2},"00:43:28","00:42:00","00:41:41",1.3715277777777778E-2,"00:41:27.829","01:31:31",{"$f":"(Z13*86400)*POWER((6.2138818/13.1094),1.07)/86400","v":2.8590548428893213E-2},10,2.9730538414146596E-2,6,{"$f":"IFERROR(IF(AB13>6,AVERAGE(SMALL((F13,H13,J13,L13:N13,R13:R13,P13,T13:W13,Y13,AA13),{1,2,3,4,5,6})),AC13),\"No race run\")","v":2.9128072751026701E-2}]
[null,"Gray","Kirsty","F",2.3680555555555555E-2,{"$f":"(E14*86400)*POWER((6.2138818/5),1.07)/86400","v":2.9880810912490775E-2},null,null,6.8472222222222226E-2,{"$f":"(I14*86400)*POWER((6.2138818/13.1094),1.07)/86400","v":3.0803439174163588E-2},null,null,"00:44:09","00:43:21",null,null,null,null,"00:25:52",{"$f":"(S14*86400)*POWER((6.2138818/3.9),1.07)/86400","v":2.9569041169417432E-2},"00:44:59",null,null,null,null,null,null,6,3.0375934345147768E-2,6,{"$f":"IFERROR(IF(AB14>6,AVERAGE(SMALL((F14,H14,J14,L14:N14,R14:R14,P14,T14:W14,Y14,AA14),{1,2,3,4,5,6})),AC14),\"No race run\")","v":3.0375934345147768E-2}]
[null,"Hutt","Sarah","F",null,null,null,null,6.8460648148148159E-2,{"$f":"(I15*86400)*POWER((6.2138818/13.1094),1.07)/86400","v":3.0798232372410014E-2},null,null,"00:45:05",null,null,null,"00:21:09",{"$f":"(Q15*86400)*POWER((10/5),1.07)/86400","v":3.0835427581427606E-2},"00:26:25",{"$f":"(S15*86400)*POWER((6.2138818/3.9),1.07)/86400","v":3.0197764338612525E-2},"00:45:03",null,"00:44:28",1.4641203703703703E-2,{"$f":"(X15*86400)*POWER((10/5),1.07)/86400","v":"00:44:15.783"},null,null,7,3.086312544383937E-2,6,{"$f":"IFERROR(IF(AB15>6,AVERAGE(SMALL((F15,H15,J15,L15:N15,R15:R15,P15,T15:W15,Y15,AA15),{1,2,3,4,5,6})),AC15),\"No race run\")","v":3.0789001289417538E-2}]
[null,"Dobson","Judith","F",2.4999999999999998E-2,{"$f":"(E16*86400)*POWER((6.2138818/5),1.07)/86400","v":3.1545724130488798E-2},null,null,6.7928240740740733E-2,{"$f":"(I16*86400)*POWER((6.2138818/13.1094),1.07)/86400","v":3.0558719491745445E-2},5.1400462962962967E-2,{"$f":"(K16*86400)*POWER((6.2138818/10),1.07)/86400","v":3.0893380092094882E-2},null,null,"00:36:14",{"$f":"(O16*86400)*POWER((6.2138818/5),1.07)/86400","v":3.1750187157260482E-2},null,null,null,null,null,null,"00:45:58",1.5520833333333333E-2,{"$f":"(X16*86400)*POWER((10/5),1.07)/86400","v":"00:46:55.340"},null,null,6,3.1542377092558659E-2,6,{"$f":"IFERROR(IF(AB16>6,AVERAGE(SMALL((F16,H16,J16,L16:N16,R16:R16,P16,T16:W16,Y16,AA16),{1,2,3,4,5,6})),AC16),\"No race run\")","v":3.1542377092558659E-2}]
[null,"Smith","Alison","F",null,null,6.8611111111111109E-2,{"$f":"(G17*86400)*POWER((6.2138818/10),1.07)/86400","v":4.1237549467673593E-2},8.4212962962962976E-2,{"$f":"(I17*86400)*POWER((6.2138818/13.1094),1.07)/86400","v":3.7884689559028781E-2},null,null,null,"00:54:27",null,null,null,null,null,null,"00:55:35",null,"00:54:46",1.8032407407407407E-2,{"$f":"(X17*86400)*POWER((10/5),1.07)/86400","v":"00:54:30.917"},"02:06:26",{"$f":"(Z17*86400)*POWER((6.2138818/13.1094),1.07)/86400","v":3.9498798102637754E-2},7,3.8703331339524576E-2,6,{"$f":"IFERROR(IF(AB17>6,AVERAGE(SMALL((F17,H17,J17,L17:N17,R17:R17,P17,T17:W17,Y17,AA17),{1,2,3,4,5,6})),AC17),\"No race run\")","v":3.8280961651499745E-2}]
[null,"Stark","Roger","M",null,null,null,null,null,null,null,null,null,"00:56:41",null,null,"00:28:54",{"$f":"(Q18*86400)*POWER((10/5),1.07)/86400","v":4.2134461328759226E-2},"00:35:36",{"$f":"(S18*86400)*POWER((6.2138818/3.9),1.07)/86400","v":4.0695536042445649E-2},"00:58:50","00:57:38",null,1.9386574074074073E-2,{"$f":"(X18*86400)*POWER((10/5),1.07)/86400","v":"00:58:36.551"},null,null,6,4.0628978902410066E-2,6,{"$f":"IFERROR(IF(AB18>6,AVERAGE(SMALL((F18,H18,J18,L18:N18,R18:R18,P18,T18:W18,Y18,AA18),{1,2,3,4,5,6})),AC18),\"No race run\")","v":4.0628978902410066E-2}]
[null,"Eaton","Sarah","F",null,null,7.3923611111111107E-2,{"$f":"(G19*86400)*POWER((6.2138818/10),1.07)/86400","v":4.4430537862690835E-2},9.4780092592592582E-2,{"$f":"(I19*86400)*POWER((6.2138818/13.1094),1.07)/86400","v":4.2638499560044896E-2},7.5173611111111108E-2,{"$f":"(K19*86400)*POWER((6.2138818/10),1.07)/86400","v":4.5181829249753711E-2},"00:58:07","00:59:25","00:46:05",{"$f":"(O19*86400)*POWER((6.2138818/5),1.07)/86400","v":4.0381447787408112E-2},null,null,"00:35:08",{"$f":"(S19*86400)*POWER((6.2138818/3.9),1.07)/86400","v":4.0162073959492221E-2},null,null,null,null,null,null,null,7,4.2059251255680018E-2,6,{"$f":"IFERROR(IF(AB19>6,AVERAGE(SMALL((F19,H19,J19,L19:N19,R19:R19,P19,T19:W19,Y19,AA19),{1,2,3,4,5,6})),AC19),\"No race run\")","v":4.1538821590001072E-2}]
[null,"Nouillan","Bill","M",3.4583333333333334E-2,{"$f":"(E20*86400)*POWER((6.2138818/5),1.07)/86400","v":4.3638251713842835E-2},null,null,9.5231481481481486E-2,{"$f":"(I20*86400)*POWER((6.2138818/13.1094),1.07)/86400","v":4.284156482843441E-2},7.3773148148148157E-2,{"$f":"(K20*86400)*POWER((6.2138818/10),1.07)/86400","v":4.4340104640174009E-2},null,"01:03:00","00:49:20",{"$f":"(O20*86400)*POWER((6.2138818/5),1.07)/86400","v":4.322932566029946E-2},null,null,"00:35:35",{"$f":"(S20*86400)*POWER((6.2138818/3.9),1.07)/86400","v":4.0676483825197306E-2},null,null,null,null,null,null,null,6,4.3079288444658005E-2,6,{"$f":"IFERROR(IF(AB20>6,AVERAGE(SMALL((F20,H20,J20,L20:N20,R20:R20,P20,T20:W20,Y20,AA20),{1,2,3,4,5,6})),AC20),\"No race run\")","v":4.3079288444658005E-2}]
[null,"Laycock","Andy","M",null,null,null,null,null,null,null,null,"00:36:50",null,null,null,"00:18:20",{"$f":"(Q21*86400)*POWER((10/5),1.07)/86400","v":2.6728897036698476E-2},null,null,null,null,null,1.2337962962962962E-2,{"$f":"(X21*86400)*POWER((10/5),1.07)/86400","v":2.5902731128291431E-2},null,null,3,2.6070110622897869E-2,3,{"$f":"IFERROR(IF(AB21>6,AVERAGE(SMALL((F21,H21,J21,L21:N21,R21:R21,P21,T21:W21,Y21,AA21),{1,2,3,4,5,6})),AC21),\"No race run\")","v":2.6070110622897869E-2}]
[null,"McCulloch","Angus","M",null,null,null,null,null,null,null,null,"00:39:00",null,null,null,null,null,null,null,null,null,null,null,null,null,null,1,2.7083333333333334E-2,1,{"$f":"IFERROR(IF(AB22>6,AVERAGE(SMALL((F22,H22,J22,L22:N22,R22:R22,P22,T22:W22,Y22,AA22),{1,2,3,4,5,6})),AC22),\"No race run\")","v":2.7083333333333334E-2}]
[null,"Scott","David","M",null,null,null,null,null,null,"01:06:35",{"$f":"(K23*86400)*POWER((6.2138818/10),1.07)/86400","v":2.7790824919594469E-2},null,null,"00:30:44",{"$f":"(O23*86400)*POWER((6.2138818/5),1.07)/86400","v":2.6930701526213581E-2},"00:18:49",{"$f":"(Q23*86400)*POWER((10/5),1.07)/86400","v":2.7433567958575072E-2},"00:23:21",{"$f":"(S23*86400)*POWER((6.2138818/3.9),1.07)/86400","v":2.6692156364918701E-2},null,null,null,null,null,null,null,4,2.7211812692325456E-2,4,{"$f":"IFERROR(IF(AB23>6,AVERAGE(SMALL((F23,H23,J23,L23:N23,R23:R23,P23,T23:W23,Y23,AA23),{1,2,3,4,5,6})),AC23),\"No race run\")","v":2.7211812692325456E-2}]
[null,"Johns","Andrew","M",null,null,null,null,null,null,null,null,"00:39:55",null,"00:31:07",{"$f":"(O24*86400)*POWER((6.2138818/5),1.07)/86400","v":2.7266605070195637E-2},null,null,null,null,null,null,null,null,null,null,null,2,2.7493256238801521E-2,2,{"$f":"IFERROR(IF(AB24>6,AVERAGE(SMALL((F24,H24,J24,L24:N24,R24:R24,P24,T24:W24,Y24,AA24),{1,2,3,4,5,6})),AC24),\"No race run\")","v":2.7493256238801521E-2}]
[null,"Shah","Rashmi","M",null,null,null,null,null,null,null,null,null,null,null,null,null,null,"00:24:08",{"$f":"(S25*86400)*POWER((6.2138818/3.9),1.07)/86400","v":2.758761057559049E-2},null,null,null,null,null,null,null,1,2.758761057559049E-2,1,{"$f":"IFERROR(IF(AB25>6,AVERAGE(SMALL((F25,H25,J25,L25:N25,R25:R25,P25,T25:W25,Y25,AA25),{1,2,3,4,5,6})),AC25),\"No race run\")","v":2.758761057559049E-2}]
[null,"Jarron","Chester","M",null,null,null,null,null,null,null,null,null,null,null,null,null,null,"00:24:10",{"$f":"(S26*86400)*POWER((6.2138818/3.9),1.07)/86400","v":2.7625715010087166E-2},null,null,null,null,null,null,null,1,2.7625715010087166E-2,1,{"$f":"IFERROR(IF(AB26>6,AVERAGE(SMALL((F26,H26,J26,L26:N26,R26:R26,P26,T26:W26,Y26,AA26),{1,2,3,4,5,6})),AC26),\"No race run\")","v":2.7625715010087166E-2}]
[null,"Hookham","Peter","M",null,null,null,null,null,null,null,null,null,null,null,null,null,null,1.8148148148148146E-2,{"$f":"(S27*86400)*POWER((6.2138818/3.9),1.07)/86400","v":2.9873876645390804E-2},"00:43:28",null,null,null,null,null,null,2,3.0029530915287997E-2,2,{"$f":"IFERROR(IF(AB27>6,AVERAGE(SMALL((F27,H27,J27,L27:N27,R27:R27,P27,T27:W27,Y27,AA27),{1,2,3,4,5,6})),AC27),\"No race run\")","v":3.0029530915287997E-2}]
[null,"Cuthbert","Keith","M",null,null,null,null,null,null,null,null,"00:43:26",null,null,null,null,null,null,null,null,null,null,null,null,null,null,1,3.0162037037037032E-2,1,{"$f":"IFERROR(IF(AB28>6,AVERAGE(SMALL((F28,H28,J28,L28:N28,R28:R28,P28,T28:W28,Y28,AA28),{1,2,3,4,5,6})),AC28),\"No race run\")","v":3.0162037037037032E-2}]
[null,"Dobson","Ben","M","00:35:01",{"$f":"(E29*86400)*POWER((6.2138818/5),1.07)/86400","v":3.0684058517665258E-2},null,null,null,null,null,null,"00:44:07",null,"00:35:20",{"$f":"(O29*86400)*POWER((6.2138818/5),1.07)/86400","v":3.0961544053998265E-2},null,null,null,null,null,null,null,null,null,null,null,3,3.0760725548579199E-2,3,{"$f":"IFERROR(IF(AB29>6,AVERAGE(SMALL((F29,H29,J29,L29:N29,R29:R29,P29,T29:W29,Y29,AA29),{1,2,3,4,5,6})),AC29),\"No race run\")","v":3.0760725548579199E-2}]
[null,"Reith","Kevin","M",2.431712962962963E-2,{"$f":"(E30*86400)*POWER((6.2138818/5),1.07)/86400","v":3.0684058517665258E-2},null,null,null,null,null,null,"00:44:28","00:44:41",null,null,null,null,null,null,null,null,null,null,null,null,null,3,3.0864593579962494E-2,3,{"$f":"IFERROR(IF(AB30>6,AVERAGE(SMALL((F30,H30,J30,L30:N30,R30:R30,P30,T30:W30,Y30,AA30),{1,2,3,4,5,6})),AC30),\"No race run\")","v":3.0864593579962494E-2}]
[null,"Porter","Hazel","F",null,null,null,null,6.6585648148148144E-2,{"$f":"(I31*86400)*POWER((6.2138818/13.1094),1.07)/86400","v":2.9954730488330479E-2},null,null,"00:43:11",null,"00:37:34",{"$f":"(O31*86400)*POWER((6.2138818/5),1.07)/86400","v":3.2918547310241547E-2},null,null,null,null,null,null,null,null,null,null,null,3,3.0953901241499316E-2,3,{"$f":"IFERROR(IF(AB31>6,AVERAGE(SMALL((F31,H31,J31,L31:N31,R31:R31,P31,T31:W31,Y31,AA31),{1,2,3,4,5,6})),AC31),\"No race run\")","v":3.0953901241499316E-2}]
[null,"Blyth","Scott","M",null,null,null,null,null,null,null,null,null,"00:46:06",null,null,null,null,"00:27:13",{"$f":"(S32*86400)*POWER((6.2138818/3.9),1.07)/86400","v":3.1112270766532647E-2},null,null,null,null,null,null,null,2,3.1563079827710769E-2,2,{"$f":"IFERROR(IF(AB32>6,AVERAGE(SMALL((F32,H32,J32,L32:N32,R32:R32,P32,T32:W32,Y32,AA32),{1,2,3,4,5,6})),AC32),\"No race run\")","v":3.1563079827710769E-2}]
[null,"Baughan","Nick","M",null,null,null,null,null,null,null,null,null,null,null,null,"00:21:47",{"$f":"(Q33*86400)*POWER((10/5),1.07)/86400","v":3.1758789479059003E-2},null,null,null,null,null,null,null,null,null,1,3.1758789479059003E-2,1,{"$f":"IFERROR(IF(AB33>6,AVERAGE(SMALL((F33,H33,J33,L33:N33,R33:R33,P33,T33:W33,Y33,AA33),{1,2,3,4,5,6})),AC33),\"No race run\")","v":3.1758789479059003E-2}]
[null,"Parsons","Simon","M",null,null,null,null,7.0682870370370368E-2,{"$f":"(I34*86400)*POWER((6.2138818/13.1094),1.07)/86400","v":3.1797938309096857E-2},null,null,null,null,null,null,null,null,null,null,null,null,null,null,null,null,null,1,3.1797938309096857E-2,1,{"$f":"IFERROR(IF(AB34>6,AVERAGE(SMALL((F34,H34,J34,L34:N34,R34:R34,P34,T34:W34,Y34,AA34),{1,2,3,4,5,6})),AC34),\"No race run\")","v":3.1797938309096857E-2}]
[null,"Rae","Alison","F",null,null,null,null,null,null,null,null,null,null,null,null,null,null,"00:28:13",{"$f":"(S35*86400)*POWER((6.2138818/3.9),1.07)/86400","v":3.2255403801432797E-2},null,null,null,null,null,null,null,1,3.2255403801432797E-2,1,{"$f":"IFERROR(IF(AB35>6,AVERAGE(SMALL((F35,H35,J35,L35:N35,R35:R35,P35,T35:W35,Y35,AA35),{1,2,3,4,5,6})),AC35),\"No race run\")","v":3.2255403801432797E-2}]
[null,"Kelly","Graeme","M",null,null,null,null,null,null,null,null,null,null,null,null,null,null,null,null,null,null,null,1.5486111111111112E-2,{"$f":"(X36*86400)*POWER((10/5),1.07)/86400","v":"00:46:49.042"},null,null,1,3.2512058395547778E-2,1,{"$f":"IFERROR(IF(AB36>6,AVERAGE(SMALL((F36,H36,J36,L36:N36,R36:R36,P36,T36:W36,Y36,AA36),{1,2,3,4,5,6})),AC36),\"No race run\")","v":3.2512058395547778E-2}]
[null,"Parsons","Vicky","F",null,null,null,null,7.2291666666666657E-2,{"$f":"(I37*86400)*POWER((6.2138818/13.1094),1.07)/86400","v":3.2521683752844102E-2},null,null,null,null,null,null,null,null,null,null,null,null,null,null,null,null,null,1,3.2521683752844102E-2,1,{"$f":"IFERROR(IF(AB37>6,AVERAGE(SMALL((F37,H37,J37,L37:N37,R37:R37,P37,T37:W37,Y37,AA37),{1,2,3,4,5,6})),AC37),\"No race run\")","v":3.2521683752844102E-2}]
[null,"Paterson","Craig","M",null,null,null,null,null,null,null,null,null,null,null,null,"00:22:24",{"$f":"(Q38*86400)*POWER((10/5),1.07)/86400","v":3.2657852379384317E-2},null,null,null,null,null,null,null,null,null,{"$f":"COUNT(F38,H38,J38,L38:N38,R38:R38,P38,T38:V38,W38,Y38,AA38)","v":1},{"$f":"IFERROR(AVERAGE(F38,H38,J38,L38:N38,R38:R38,P38,T38:W38,Y38,AA38),\"No race run\")","v":3.2657852379384317E-2},{"$f":"IF(COUNT(F38,H38,J38,L38,M38,N38,P38,R38,T38,U38,V38,W38,Y38)>6,6,COUNT(F38,H38,J38,L38,M38,N38,P38,R38,T38,U38,V38,W38,Y38))","v":1},{"$f":"IFERROR(IF(AB38>6,AVERAGE(SMALL((F38,H38,J38,L38:N38,R38:R38,P38,T38:W38,Y38,AA38),{1,2,3,4,5,6})),AC38),\"No race run\")","v":3.2657852379384317E-2}]
[null,"Hill","Maureen","F",null,null,"01:18:43",{"$f":"(G39*86400)*POWER((6.2138818/10),1.07)/86400","v":3.2855085380536837E-2},null,null,null,null,null,null,null,null,null,null,null,null,null,null,null,null,null,null,null,1,3.2855085380536837E-2,1,{"$f":"IFERROR(IF(AB39>6,AVERAGE(SMALL((F39,H39,J39,L39:N39,R39:R39,P39,T39:W39,Y39,AA39),{1,2,3,4,5,6})),AC39),\"No race run\")","v":3.2855085380536837E-2}]
[null,"Coutts","Pippa","F",null,null,"01:20:56",{"$f":"(G40*86400)*POWER((6.2138818/10),1.07)/86400","v":3.3780286810901311E-2},null,null,null,null,null,null,null,null,null,null,null,null,null,null,null,null,null,null,null,1,3.3780286810901311E-2,1,{"$f":"IFERROR(IF(AB40>6,AVERAGE(SMALL((F40,H40,J40,L40:N40,R40:R40,P40,T40:W40,Y40,AA40),{1,2,3,4,5,6})),AC40),\"No race run\")","v":3.3780286810901311E-2}]
[null,"Reith","Finlay","M",null,null,null,null,null,null,null,null,null,"00:48:47",null,null,null,null,null,null,null,null,null,null,null,null,null,1,3.3877314814814811E-2,1,{"$f":"IFERROR(IF(AB41>6,AVERAGE(SMALL((F41,H41,J41,L41:N41,R41:R41,P41,T41:W41,Y41,AA41),{1,2,3,4,5,6})),AC41),\"No race run\")","v":3.3877314814814811E-2}]
[null,"Cowan","Brian","M",2.5659722222222223E-2,{"$f":"(E42*86400)*POWER((6.2138818/5),1.07)/86400","v":3.2378180739487804E-2},null,null,7.3749999999999996E-2,{"$f":"(I42*86400)*POWER((6.2138818/13.1094),1.07)/86400","v":3.3177740773794859E-2},null,null,null,"00:53:35",null,null,null,null,null,null,null,null,null,null,null,null,null,3,3.4255523220476931E-2,3,{"$f":"IFERROR(IF(AB42>6,AVERAGE(SMALL((F42,H42,J42,L42:N42,R42:R42,P42,T42:W42,Y42,AA42),{1,2,3,4,5,6})),AC42),\"No race run\")","v":3.4255523220476931E-2}]
[null,"Baughan","Paul","M",null,null,null,null,null,null,null,null,null,null,null,null,"00:23:33",{"$f":"(Q43*86400)*POWER((10/5),1.07)/86400","v":3.4334483193504496E-2},null,null,null,null,null,null,null,null,null,1,3.4334483193504496E-2,1,{"$f":"IFERROR(IF(AB43>6,AVERAGE(SMALL((F43,H43,J43,L43:N43,R43:R43,P43,T43:W43,Y43,AA43),{1,2,3,4,5,6})),AC43),\"No race run\")","v":3.4334483193504496E-2}]
[null,"Wilson","Anne","F",null,null,null,null,null,null,null,null,"00:50:49",null,"00:38:44",{"$f":"(O44*86400)*POWER((6.2138818/5),1.07)/86400","v":3.3940862444099981E-2},null,null,null,null,null,null,"00:48:46",null,null,null,null,3,3.4365318345564187E-2,3,{"$f":"IFERROR(IF(AB44>6,AVERAGE(SMALL((F44,H44,J44,L44:N44,R44:R44,P44,T44:W44,Y44,AA44),{1,2,3,4,5,6})),AC44),\"No race run\")","v":3.4365318345564187E-2}]
[null,"Lopez","Gill","F",null,null,null,null,null,null,null,null,"00:50:50",null,"00:38:34",{"$f":"(O45*86400)*POWER((6.2138818/5),1.07)/86400","v":3.379481742497735E-2},null,null,null,null,null,null,null,null,null,null,null,2,3.4547871675451633E-2,2,{"$f":"IFERROR(IF(AB45>6,AVERAGE(SMALL((F45,H45,J45,L45:N45,R45:R45,P45,T45:W45,Y45,AA45),{1,2,3,4,5,6})),AC45),\"No race run\")","v":3.4547871675451633E-2}]
[null,"Paterson","Scott","M",null,null,null,null,7.8229166666666669E-2,{"$f":"(I46*86400)*POWER((6.2138818/13.1094),1.07)/86400","v":3.5192773052429287E-2},null,null,"00:48:59",null,null,null,null,null,null,null,null,null,null,null,null,null,null,2,3.4604488378066497E-2,2,{"$f":"IFERROR(IF(AB46>6,AVERAGE(SMALL((F46,H46,J46,L46:N46,R46:R46,P46,T46:W46,Y46,AA46),{1,2,3,4,5,6})),AC46),\"No race run\")","v":3.4604488378066497E-2}]
[null,"Rennie","Amanda","F",null,null,null,null,null,null,"01:22:12",{"$f":"(K47*86400)*POWER((6.2138818/10),1.07)/86400","v":3.4308973342538157E-2},"00:47:58","00:52:35",null,null,null,null,null,null,null,null,null,1.6377314814814813E-2,{"$f":"(X47*86400)*POWER((10/5),1.07)/86400","v":"00:49:30.698"},null,null,4,3.4629610854885931E-2,4,{"$f":"IFERROR(IF(AB47>6,AVERAGE(SMALL((F47,H47,J47,L47:N47,R47:R47,P47,T47:W47,Y47,AA47),{1,2,3,4,5,6})),AC47),\"No race run\")","v":3.4629610854885931E-2}]
[null,"Findlay","Valerie","F",null,null,5.994212962962963E-2,{"$f":"(G48*86400)*POWER((6.2138818/10),1.07)/86400","v":3.6027204570357886E-2},null,null,null,null,"00:48:52",null,"00:39:32",{"$f":"(O48*86400)*POWER((6.2138818/5),1.07)/86400","v":3.4641878535888619E-2},null,null,null,null,"00:50:57",null,null,1.6655092592592593E-2,{"$f":"(X48*86400)*POWER((10/5),1.07)/86400","v":"00:50:21.085"},null,null,5,3.4990493971867792E-2,5,{"$f":"IFERROR(IF(AB48>6,AVERAGE(SMALL((F48,H48,J48,L48:N48,R48:R48,P48,T48:W48,Y48,AA48),{1,2,3,4,5,6})),AC48),\"No race run\")","v":3.4990493971867792E-2}]
[null,"Grieve","Wendy","F",null,null,null,null,null,null,"01:27:07",{"$f":"(K49*86400)*POWER((6.2138818/10),1.07)/86400","v":3.6361111853496948E-2},null,"00:50:20","00:38:57",{"$f":"(O49*86400)*POWER((6.2138818/5),1.07)/86400","v":3.4130720968959402E-2},null,null,null,null,null,null,null,1.6493055555555556E-2,{"$f":"(X49*86400)*POWER((10/5),1.07)/86400","v":"00:49:51.693"},null,null,4,3.5017901921834405E-2,4,{"$f":"IFERROR(IF(AB49>6,AVERAGE(SMALL((F49,H49,J49,L49:N49,R49:R49,P49,T49:W49,Y49,AA49),{1,2,3,4,5,6})),AC49),\"No race run\")","v":3.5017901921834405E-2}]
[null,"Palmer","Linda","F",null,null,null,null,null,null,null,null,null,null,"00:40:04",{"$f":"(O50*86400)*POWER((6.2138818/5),1.07)/86400","v":3.5109222597081047E-2},null,null,null,null,null,null,null,null,null,null,null,1,3.5109222597081047E-2,1,{"$f":"IFERROR(IF(AB50>6,AVERAGE(SMALL((F50,H50,J50,L50:N50,R50:R50,P50,T50:W50,Y50,AA50),{1,2,3,4,5,6})),AC50),\"No race run\")","v":3.5109222597081047E-2}]
[null,"Jubber","Mike","M",null,null,null,null,null,null,null,null,3.5300925925925923E-2,null,"00:39:45",{"$f":"(O51*86400)*POWER((6.2138818/5),1.07)/86400","v":3.4831737060748047E-2},null,null,"00:31:03",{"$f":"(S51*86400)*POWER((6.2138818/3.9),1.07)/86400","v":3.5494280733649915E-2},null,null,null,null,null,null,null,3,3.5208981240107962E-2,3,{"$f":"IFERROR(IF(AB51>6,AVERAGE(SMALL((F51,H51,J51,L51:N51,R51:R51,P51,T51:W51,Y51,AA51),{1,2,3,4,5,6})),AC51),\"No race run\")","v":3.5208981240107962E-2}]
[null,"Boyle","John","M",null,null,null,null,null,null,"01:30:12",{"$f":"(K52*86400)*POWER((6.2138818/10),1.07)/86400","v":3.764804617392873E-2},null,null,null,null,null,null,null,null,"00:47:19",null,null,null,null,null,null,2,3.5253421235112513E-2,2,{"$f":"IFERROR(IF(AB52>6,AVERAGE(SMALL((F52,H52,J52,L52:N52,R52:R52,P52,T52:W52,Y52,AA52),{1,2,3,4,5,6})),AC52),\"No race run\")","v":3.5253421235112513E-2}]
[null,"Bilton","Geoff","M",null,null,null,null,null,null,null,null,null,null,"00:40:35",{"$f":"(O53*86400)*POWER((6.2138818/5),1.07)/86400","v":3.5561962156361211E-2},null,null,"00:31:14",{"$f":"(S53*86400)*POWER((6.2138818/3.9),1.07)/86400","v":3.570385512338161E-2},"00:52:57","00:51:17",null,1.7465277777777777E-2,{"$f":"(X53*86400)*POWER((10/5),1.07)/86400","v":"00:52:48.045"},null,null,5,3.6063452694778231E-2,5,{"$f":"IFERROR(IF(AB53>6,AVERAGE(SMALL((F53,H53,J53,L53:N53,R53:R53,P53,T53:W53,Y53,AA53),{1,2,3,4,5,6})),AC53),\"No race run\")","v":3.6063452694778231E-2}]
[null,"Myerscough","John","M",null,null,null,null,null,null,null,null,null,null,null,null,null,null,"00:31:39",{"$f":"(S54*86400)*POWER((6.2138818/3.9),1.07)/86400","v":3.6180160554590009E-2},null,null,null,null,null,null,null,1,3.6180160554590009E-2,1,{"$f":"IFERROR(IF(AB54>6,AVERAGE(SMALL((F54,H54,J54,L54:N54,R54:R54,P54,T54:W54,Y54,AA54),{1,2,3,4,5,6})),AC54),\"No race run\")","v":3.6180160554590009E-2}]
[null,"Gray","Duncan","M",null,null,null,null,null,null,null,null,null,"00:53:30",null,null,null,null,"00:31:21",{"$f":"(S55*86400)*POWER((6.2138818/3.9),1.07)/86400","v":3.5837220644119976E-2},null,null,null,null,null,null,null,2,3.6494999210948877E-2,2,{"$f":"IFERROR(IF(AB55>6,AVERAGE(SMALL((F55,H55,J55,L55:N55,R55:R55,P55,T55:W55,Y55,AA55),{1,2,3,4,5,6})),AC55),\"No race run\")","v":3.6494999210948877E-2}]
[null,"Hunter","Neil","M",null,null,null,null,null,null,null,null,null,"00:52:11","00:41:11",{"$f":"(O56*86400)*POWER((6.2138818/5),1.07)/86400","v":3.6087724225202691E-2},"00:25:41",{"$f":"(Q56*86400)*POWER((10/5),1.07)/86400","v":3.7444754848683953E-2},null,null,null,null,null,null,null,null,null,3,3.6590301666604187E-2,3,{"$f":"IFERROR(IF(AB56>6,AVERAGE(SMALL((F56,H56,J56,L56:N56,R56:R56,P56,T56:W56,Y56,AA56),{1,2,3,4,5,6})),AC56),\"No race run\")","v":3.6590301666604187E-2}]
[null,"Kemp","Gillian","F",null,null,6.3842592592592604E-2,{"$f":"(G57*86400)*POWER((6.2138818/10),1.07)/86400","v":3.837151195406336E-2},null,null,null,null,"00:52:12",null,null,null,null,null,null,null,null,null,null,null,null,null,null,2,3.7310755977031679E-2,2,{"$f":"IFERROR(IF(AB57>6,AVERAGE(SMALL((F57,H57,J57,L57:N57,R57:R57,P57,T57:W57,Y57,AA57),{1,2,3,4,5,6})),AC57),\"No race run\")","v":3.7310755977031679E-2}]
[null,"Malcolm","Ann","F",null,null,6.2905092592592596E-2,{"$f":"(G58*86400)*POWER((6.2138818/10),1.07)/86400","v":3.7808043413766194E-2},null,null,null,null,null,null,null,null,null,null,null,null,null,null,null,null,null,null,null,1,3.7808043413766194E-2,1,{"$f":"IFERROR(IF(AB58>6,AVERAGE(SMALL((F58,H58,J58,L58:N58,R58:R58,P58,T58:W58,Y58,AA58),{1,2,3,4,5,6})),AC58),\"No race run\")","v":3.7808043413766194E-2}]
[null,"Houston","David","M",null,null,null,null,null,null,null,null,null,"00:54:20","00:43:39",{"$f":"(O59*86400)*POWER((6.2138818/5),1.07)/86400","v":3.8249190508217658E-2},null,null,null,null,null,null,null,null,null,null,null,2,3.7990335994849571E-2,2,{"$f":"IFERROR(IF(AB59>6,AVERAGE(SMALL((F59,H59,J59,L59:N59,R59:R59,P59,T59:W59,Y59,AA59),{1,2,3,4,5,6})),AC59),\"No race run\")","v":3.7990335994849571E-2}]
[null,"Dobson","Stuart","M",3.079861111111111E-2,{"$f":"(E60*86400)*POWER((6.2138818/5),1.07)/86400","v":3.8862579588532724E-2},null,null,null,null,null,null,"00:54:35","00:54:40","00:43:31",{"$f":"(O60*86400)*POWER((6.2138818/5),1.07)/86400","v":3.8132354492919553E-2},null,null,null,null,null,null,null,1.7974537037037035E-2,{"$f":"(X60*86400)*POWER((10/5),1.07)/86400","v":"00:54:20.420"},null,null,5,3.811986649067297E-2,5,{"$f":"IFERROR(IF(AB60>6,AVERAGE(SMALL((F60,H60,J60,L60:N60,R60:R60,P60,T60:W60,Y60,AA60),{1,2,3,4,5,6})),AC60),\"No race run\")","v":3.811986649067297E-2}]
[null,"Cuthbert","Catriona","F",null,null,null,null,8.4814814814814801E-2,{"$f":"(I61*86400)*POWER((6.2138818/13.1094),1.07)/86400","v":3.8155443250214797E-2},null,null,null,null,null,null,null,null,null,null,null,null,null,null,null,null,null,1,3.8155443250214797E-2,1,{"$f":"IFERROR(IF(AB61>6,AVERAGE(SMALL((F61,H61,J61,L61:N61,R61:R61,P61,T61:W61,Y61,AA61),{1,2,3,4,5,6})),AC61),\"No race run\")","v":3.8155443250214797E-2}]
[null,"Robertson","Alison","F",null,null,null,null,null,null,null,null,"00:54:50",null,null,null,null,null,2.3333333333333334E-2,{"$f":"(S62*86400)*POWER((6.2138818/3.9),1.07)/86400","v":3.8409269972645321E-2},null,null,null,null,null,null,null,2,3.824398683817451E-2,2,{"$f":"IFERROR(IF(AB62>6,AVERAGE(SMALL((F62,H62,J62,L62:N62,R62:R62,P62,T62:W62,Y62,AA62),{1,2,3,4,5,6})),AC62),\"No race run\")","v":3.824398683817451E-2}]
[null,"Houston","Alison ","F",null,null,null,null,null,null,null,null,null,"00:55:21","00:45:11",{"$f":"(O63*86400)*POWER((6.2138818/5),1.07)/86400","v":3.9592804684145881E-2},null,null,null,null,null,null,null,null,null,null,null,2,3.9015152342072937E-2,2,{"$f":"IFERROR(IF(AB63>6,AVERAGE(SMALL((F63,H63,J63,L63:N63,R63:R63,P63,T63:W63,Y63,AA63),{1,2,3,4,5,6})),AC63),\"No race run\")","v":3.9015152342072937E-2}]
[null,"Macintyre","Anne","F",null,null,6.671296296296296E-2,{"$f":"(G64*86400)*POWER((6.2138818/10),1.07)/86400","v":4.0096699583615149E-2},null,null,null,null,"00:56:10",null,null,null,null,null,"00:33:59",{"$f":"(S64*86400)*POWER((6.2138818/3.9),1.07)/86400","v":3.8847470969357055E-2},"00:57:15",null,"00:54:13",null,null,null,null,5,3.9071241518001849E-2,5,{"$f":"IFERROR(IF(AB64>6,AVERAGE(SMALL((F64,H64,J64,L64:N64,R64:R64,P64,T64:W64,Y64,AA64),{1,2,3,4,5,6})),AC64),\"No race run\")","v":3.9071241518001849E-2}]
[null,"Jackson","Michelle","F",null,null,null,null,null,null,null,null,"00:57:20",null,null,null,null,null,null,null,null,null,null,null,null,null,null,1,3.9814814814814817E-2,1,{"$f":"IFERROR(IF(AB65>6,AVERAGE(SMALL((F65,H65,J65,L65:N65,R65:R65,P65,T65:W65,Y65,AA65),{1,2,3,4,5,6})),AC65),\"No race run\")","v":3.9814814814814817E-2}]
[null,"Kemp","Fiona","F",null,null,null,null,null,null,null,null,"01:00:05",null,null,null,null,null,null,null,null,null,null,1.8854166666666665E-2,{"$f":"(X66*86400)*POWER((10/5),1.07)/86400","v":"00:56:59.977"},null,null,2,4.0653801824328428E-2,2,{"$f":"IFERROR(IF(AB66>6,AVERAGE(SMALL((F66,H66,J66,L66:N66,R66:R66,P66,T66:W66,Y66,AA66),{1,2,3,4,5,6})),AC66),\"No race run\")","v":4.0653801824328428E-2}]
[null,"Lopez","Hannah","F",null,null,null,null,null,null,null,null,null,null,"00:46:18",{"$f":"(O67*86400)*POWER((6.2138818/5),1.07)/86400","v":4.0571306312267526E-2},null,null,"00:35:21",{"$f":"(S67*86400)*POWER((6.2138818/3.9),1.07)/86400","v":4.0409752783720609E-2},null,null,"00:59:09",null,null,null,null,3,4.0685815994959011E-2,3,{"$f":"IFERROR(IF(AB67>6,AVERAGE(SMALL((F67,H67,J67,L67:N67,R67:R67,P67,T67:W67,Y67,AA67),{1,2,3,4,5,6})),AC67),\"No race run\")","v":4.0685815994959011E-2}]
[null,"MacCalman","Sandy","M",null,null,null,null,null,null,null,null,null,null,null,null,null,null,"00:42:52",{"$f":"(S68*86400)*POWER((6.2138818/3.9),1.07)/86400","v":4.9002302762720128E-2},null,null,null,null,null,null,null,1,4.9002302762720128E-2,1,{"$f":"IFERROR(IF(AB68>6,AVERAGE(SMALL((F68,H68,J68,L68:N68,R68:R68,P68,T68:W68,Y68,AA68),{1,2,3,4,5,6})),AC68),\"No race run\")","v":4.9002302762720128E-2}]
[null,"Carmichael","Isabella","F",null,null,null,null,null,null,null,null,null,null,null,null,null,null,null,null,null,null,null,null,null,null,null,0,"No race run",0,{"$f":"IFERROR(IF(AB69>6,AVERAGE(SMALL((F69,H69,J69,L69:N69,R69:R69,P69,T69:W69,Y69,AA69),{1,2,3,4,5,6})),AC69),\"No race run\")","v":"No race run"}]
[null,"Rose","Julie","F",null,null,null,null,null,null,null,null,null,null,null,null,null,null,null,null,null,null,null,null,null,null,null,{"$f":"COUNT(F70,H70,J70,L70:N70,R70:R70,P70,T70:V70,W70,Y70,AA70)","v":0},{"$f":"IFERROR(AVERAGE(F70,H70,J70,L70:N70,R70:R70,P70,T70:W70,Y70,AA70),\"No race run\")","v":"No race run"},{"$f":"IF(COUNT(F70,H70,J70,L70,M70,N70,P70,R70,T70,U70,V70,W70,Y70)>6,6,COUNT(F70,H70,J70,L70,M70,N70,P70,R70,T70,U70,V70,W70,Y70))","v":0},{"$f":"IFERROR(IF(AB70>6,AVERAGE(SMALL((F70,H70,J70,L70:N70,R70:R70,P70,T70:W70,Y70,AA70),{1,2,3,4,5,6})),AC70),\"No race run\")","v":"No race run"}]
[null,"Jackson","Martin","M",null,null,null,null,null,null,null,null,null,null,null,null,null,null,null,null,null,null,null,null,null,null,null,0,"No race run",0,{"$f":"IFERROR(IF(AB71>6,AVERAGE(SMALL((F71,H71,J71,L71:N71,R71:R71,P71,T71:W71,Y71,AA71),{1,2,3,4,5,6})),AC71),\"No race run\")","v":"No race run"}]
[null,"Alexander","Denise","F",null,null,null,null,null,null,null,null,null,null,null,null,null,null,null,null,null,null,null,null,null,null,null,0,"No race run",0,{"$f":"IFERROR(IF(AB72>6,AVERAGE(SMALL((F72,H72,J72,L72:N72,R72:R72,P72,T72:W72,Y72,AA72),{1,2,3,4,5,6})),AC72),\"No race run\")","v":"No race run"}]
[null,"Donnachie","Gordon ","M",null,null,null,null,null,null,null,null,null,null,null,null,null,null,null,null,null,null,null,null,null,null,null,0,"No race run",0,{"$f":"IFERROR(IF(AB73>6,AVERAGE(SMALL((F73,H73,J73,L73:N73,R73:R73,P73,T73:W73,Y73,AA73),{1,2,3,4,5,6})),AC73),\"No race run\")","v":"No race run"}]
[null,"Robertson","Neil","M",null,null,null,null,null,null,null,null,null,null,null,null,null,null,null,null,null,null,null,null,null,null,null,0,"No race run",0,{"$f":"IFERROR(IF(AB74>6,AVERAGE(SMALL((F74,H74,J74,L74:N74,R74:R74,P74,T74:W74,Y74,AA74),{1,2,3,4,5,6})),AC74),\"No race run\")","v":"No race run"}]
[null,"Agnew","Gillian","F",null,null,null,null,null,null,null,null,null,null,null,null,null,null,null,null,null,null,null,null,null,null,null,0,"No race run",0,{"$f":"IFERROR(IF(AB75>6,AVERAGE(SMALL((F75,H75,J75,L75:N75,R75:R75,P75,T75:W75,Y75,AA75),{1,2,3,4,5,6})),AC75),\"No race run\")","v":"No race run"}]
[null,"Black","Gillian","F",null,null,null,null,null,null,null,null,null,null,null,null,null,null,null,null,null,null,null,null,null,null,null,0,"No race run",0,{"$f":"IFERROR(IF(AB76>6,AVERAGE(SMALL((F76,H76,J76,L76:N76,R76:R76,P76,T76:W76,Y76,AA76),{1,2,3,4,5,6})),AC76),\"No race run\")","v":"No race run"}]
[null,"Koziel","Joanne","F",null,null,null,null,null,null,null,null,null,null,null,null,null,null,null,null,null,null,null,null,null,null,null,0,"No race run",0,{"$f":"IFERROR(IF(AB77>6,AVERAGE(SMALL((F77,H77,J77,L77:N77,R77:R77,P77,T77:W77,Y77,AA77),{1,2,3,4,5,6})),AC77),\"No race run\")","v":"No race run"}]
[null,"Macdonald","Anne","F",null,null,null,null,null,null,null,null,null,null,null,null,null,null,null,null,null,null,null,null,null,null,null,0,"No race run",0,{"$f":"IFERROR(IF(AB78>6,AVERAGE(SMALL((F78,H78,J78,L78:N78,R78:R78,P78,T78:W78,Y78,AA78),{1,2,3,4,5,6})),AC78),\"No race run\")","v":"No race run"}]
[null,"Malcolm","Gregor","M",null,null,null,null,null,null,null,null,null,null,null,null,null,null,null,null,null,null,null,null,null,null,null,0,"No race run",0,{"$f":"IFERROR(IF(AB79>6,AVERAGE(SMALL((F79,H79,J79,L79:N79,R79:R79,P79,T79:W79,Y79,AA79),{1,2,3,4,5,6})),AC79),\"No race run\")","v":"No race run"}]
[null,"Mulhern","Andrew","M",null,null,null,null,null,null,null,null,null,null,null,null,null,null,null,null,null,null,null,null,null,null,null,0,"No race run",0,{"$f":"IFERROR(IF(AB80>6,AVERAGE(SMALL((F80,H80,J80,L80:N80,R80:R80,P80,T80:W80,Y80,AA80),{1,2,3,4,5,6})),AC80),\"No race run\")","v":"No race run"}]
[null,"Coutts","Sarah","F",null,null,null,null,null,null,null,null,null,null,null,null,null,null,null,null,null,null,null,null,null,null,null,0,"No race run",0,{"$f":"IFERROR(IF(AB81>6,AVERAGE(SMALL((F81,H81,J81,L81:N81,R81:R81,P81,T81:W81,Y81,AA81),{1,2,3,4,5,6})),AC81),\"No race run\")","v":"No race run"}]
[null,"Beveridge","John","M",null,null,null,null,null,null,null,null,null,null,null,null,null,null,null,null,null,null,null,null,null,null,null,0,"No race run",0,{"$f":"IFERROR(IF(AB82>6,AVERAGE(SMALL((F82,H82,J82,L82:N82,R82:R82,P82,T82:W82,Y82,AA82),{1,2,3,4,5,6})),AC82),\"No race run\")","v":"No race run"}]
[null,"Coutts","Pippa","F",null,null,null,null,null,null,null,null,null,null,null,null,null,null,null,null,null,null,null,null,null,null,null,0,"No race run",0,{"$f":"IFERROR(IF(AB83>6,AVERAGE(SMALL((F83,H83,J83,L83:N83,R83:R83,P83,T83:W83,Y83,AA83),{1,2,3,4,5,6})),AC83),\"No race run\")","v":"No race run"}]
[null,"Myerscough","Christine","F",null,null,null,null,null,null,null,null,null,null,null,null,null,null,null,null,null,null,null,null,null,null,null,0,"No race run",0,{"$f":"IFERROR(IF(AB84>6,AVERAGE(SMALL((F84,H84,J84,L84:N84,R84:R84,P84,T84:W84,Y84,AA84),{1,2,3,4,5,6})),AC84),\"No race run\")","v":"No race run"}]
[null,"Hunter","Lynn","F",null,null,null,null,null,null,null,null,null,null,null,null,null,null,null,null,null,null,null,null,null,null,null,0,"No race run",0,{"$f":"IFERROR(IF(AB85>6,AVERAGE(SMALL((F85,H85,J85,L85:N85,R85:R85,P85,T85:W85,Y85,AA85),{1,2,3,4,5,6})),AC85),\"No race run\")","v":"No race run"}]
[null,"Skinner","Archie","M",null,null,null,null,null,null,null,null,null,null,null,null,null,null,null,null,null,null,null,null,null,null,null,0,"No race run",0,{"$f":"IFERROR(IF(AB86>6,AVERAGE(SMALL((F86,H86,J86,L86:N86,R86:R86,P86,T86:W86,Y86,AA86),{1,2,3,4,5,6})),AC86),\"No race run\")","v":"No race run"}]
[null,"Hunter","Morna","F",null,null,null,null,null,null,null,null,null,null,null,null,null,null,null,null,null,null,null,null,null,null,null,0,"No race run",0,{"$f":"IFERROR(IF(AB87>6,AVERAGE(SMALL((F87,H87,J87,L87:N87,R87:R87,P87,T87:W87,Y87,AA87),{1,2,3,4,5,6})),AC87),\"No race run\")","v":"No race run"}]
[null,"Rogowski","Andreas","M",null,null,null,null,null,null,null,null,null,null,null,null,null,null,null,null,null,null,null,null,null,null,null,0,"No race run",0,{"$f":"IFERROR(IF(AB88>6,AVERAGE(SMALL((F88,H88,J88,L88:N88,R88:R88,P88,T88:W88,Y88,AA88),{1,2,3,4,5,6})),AC88),\"No race run\")","v":"No race run"}]
[null,"Robertson","Struan","M",null,null,null,null,null,null,null,null,null,null,null,null,null,null,null,null,null,null,null,null,null,null,null,0,"No race run",0,{"$f":"IFERROR(IF(AB89>6,AVERAGE(SMALL((F89,H89,J89,L89:N89,R89:R89,P89,T89:W89,Y89,AA89),{1,2,3,4,5,6})),AC89),\"No race run\")","v":"No race run"}]
[null,"Cafferkey","Michael","M",null,null,null,null,null,null,null,null,null,null,null,null,null,null,null,null,null,null,null,null,null,null,null,0,"No race run",0,{"$f":"IFERROR(IF(AB90>6,AVERAGE(SMALL((F90,H90,J90,L90:N90,R90:R90,P90,T90:W90,Y90,AA90),{1,2,3,4,5,6})),AC90),\"No race run\")","v":"No race run"}]
[null,"Smith","Norman","M",null,null,null,null,null,null,null,null,null,null,null,null,null,null,null,null,null,null,null,null,null,null,null,0,"No race run",0,{"$f":"IFERROR(IF(AB91>6,AVERAGE(SMALL((F91,H91,J91,L91:N91,R91:R91,P91,T91:W91,Y91,AA91),{1,2,3,4,5,6})),AC91),\"No race run\")","v":"No race run"}]
[null,"Hill","Lisa","F",null,null,null,null,null,null,null,null,null,null,null,null,null,null,null,null,null,null,null,null,null,null,null,0,"No race run",0,{"$f":"IFERROR(IF(AB92>6,AVERAGE(SMALL((F92,H92,J92,L92:N92,R92:R92,P92,T92:W92,Y92,AA92),{1,2,3,4,5,6})),AC92),\"No race run\")","v":"No race run"}]
[null,"Logan","Keith","M",null,null,null,null,null,null,null,null,null,null,null,null,null,null,null,null,null,null,null,null,null,null,null,0,"No race run",0,{"$f":"IFERROR(IF(AB93>6,AVERAGE(SMALL((F93,H93,J93,L93:N93,R93:R93,P93,T93:W93,Y93,AA93),{1,2,3,4,5,6})),AC93),\"No race run\")","v":"No race run"}]

{"sheet":"Sheet2","index":1,"n_rows":0,"n_cols":0,"rows_kept":0,"cut":false,"hidden":false,"merged":[]}

{"sheet":"Sheet3","index":2,"n_rows":0,"n_cols":0,"rows_kept":0,"cut":false,"hidden":false,"merged":[]}